Mon Dec 17 00:01:01 2018

/home/sbinger1/pencil-code/bin/pencil-test --auto-test-options=--config-files='/home/sbinger1/bin/GNU_Linux.conf' -D /home/sbinger1/pencil-code --use-pc_auto-test -N15 -uc -rs -l -H

Teaching-server:

Updated to git revision 4824f051d07a24a4fa31417b69fa761e9b43fab8

samples/no-modules: (1/53)
    Compiling..            [double]           ok        00:37
    Starting..                                ok        00:00
    Running..              [KEEP_RELOADING]   ok        00:00
    Validating results..                      ok      
    Time used:                                        00:38 = 00:37 + 00:00

samples/most-modules: (2/53)
    Compiling..                               ok        01:28
    Starting..                                ok        00:01
    Running..              [KEEP_RELOADING]   ok        00:20
    Validating results..                      ok      
    Time used:                                        01:50 = 01:28 + 00:22

samples/backwards-compatible: (3/53)
    Compiling..                               ok        01:17
    Starting..                                ok        00:00
    Running..              [KEEP_RELOADING]   ok        00:00
    Validating results..                      ok      
    Time used:                                        01:18 = 01:17 + 00:00

samples/1d-tests/implicit_diffusion: (4/53)
    Compiling..                               ok        00:51
    Starting..                                ok        00:00
    Running..              [KEEP_RELOADING]   ok        00:00
    Validating results..                      ok      
    Time used:                                        00:51 = 00:51 + 00:00

samples/2d-tests/chemistry_GrayScott: (5/53)
    Compiling..                               ok        00:44
    Starting..                                ok        00:00
    Running..              [KEEP_RELOADING]   ok        00:04
    Validating results..                      ok      
    Time used:                                        00:49 = 00:44 + 00:04

samples/2d-tests/shearwave-dust-par: (6/53)
    Compiling..                               ok        01:06
    Starting..                                ok        00:00
    Running..              [KEEP_RELOADING]   ok        00:05
    Validating results..                      ok      
    Time used:                                        01:12 = 01:06 + 00:05

samples/dust-vortex: (7/53)
    Compiling..                               ok        01:06
    Starting..                                ok        00:00
    Running..              [KEEP_RELOADING]   ok        00:03
    Validating results..                      ok      
    Time used:                                        01:09 = 01:06 + 00:03

samples/damped_alfven_waves: (8/53)
    Compiling..                               ok        01:10
    Starting..                                ok        00:01
    Running..              [KEEP_RELOADING]   ok        01:53
    Validating results..                      ok      
    Time used:                                        03:05 = 01:10 + 01:54

samples/corona: (9/53)
    Compiling..                               not ok:   00:25
Running make '-j' 'FFLAGS_DOUBLE=-fdefault-real-8 -fdefault-double-8' 'CFLAGS_DOUBLE=-DDOUBLE_PRECISION' 'LD_MPI=' 'CFLAGS_FFTW3=' 'FFLAGS_FFTW3=' 'LD_FFTW3=' 'CFLAGS_FFTW2=' 'FFLAGS_FFTW2=' 'LD_FFTW2=' 'FC=mpif90' 'F77=mpif77' 'FFLAGS=-O' 'LDFLAGS_HELPER=-dynamic -ldl' 'FSTD_95=-std=f95' 'FSTD_2003=-std=f2003' 'CC=mpicc' 'CFLAGS=-DFUNDERSC=1' 'default_to_be'
MAKING src/Makefile.inc
precision-check: No such file src/.current-precision -- creating new one at ./src/scripts/precision-check line 36.
touch src/.build-history
echo "@"`hostname` "("`date`")" >> src/.build-history
( cd src && \
  echo "===== " make FROM_PARENT=src/ -f Makefile.src code "====="; \
  make FROM_PARENT=src/ -f Makefile.src default_to_be \
)
=====  make FROM_PARENT=src/ -f Makefile.src code =====
make[1]: Entering directory '/home/sbinger1/pencil-code/samples/corona/src'
scripts/mkcparam -b noborder_profiles.f90 nochemistry.f90 nochiral.f90 nocosmicray.f90 nocosmicrayflux.f90 density.f90 deriv.f90 nodetonate.f90 nodustdensity.f90 nodustvelocity.f90 temperature_idealgas.f90 eos_idealgas.f90 nofixed_point.f90 noforcing.f90 gravity_simple.f90 nogpu.f90 grid.f90 noheatflux.f90 hydro.f90 nohyperresi_strict.f90 nohypervisc_strict.f90 noimplicit_diffusion.f90 noimplicit_physics.f90 noinitial_condition.f90 nointerstellar.f90 nolorenz_gauge.f90 magnetic.f90 magnetic/nomeanfield.f90 magnetic/nomeanfield_demfdt.f90 noneutraldensity.f90 noneutralvelocity.f90 noNSCBC.f90 noopacity.f90 noparticles.f90 noparticles_adaptation.f90 noparticles_coagulation.f90 noparticles_condensation.f90  noparticles_collisions.f90 noparticles_map.f90 noparticles_density.f90  noparticles_mass.f90 noparticles_number.f90 noparticles_radius.f90 noparticles_potential.f90 noparticles_grad.f90 noparticles_selfgravity.f90 noparticles_sink.f90 noparticles_drag.f90 noparticles_spin.f90 noparticles_stalker.f90 noparticles_lyapunov.f90 noparticles_caustics.f90 noparticles_stirring.f90 noparticles_diagnos_dv.f90 noparticles_diagnos_state.f90 noparticles_persistence.f90 noparticles_temperature.f90 noparticles_adsorbed.f90 noparticles_surfspec.f90 noparticles_chemistry.f90 nopointmasses.f90 nopoisson.f90 nopolymer.f90 nopower_spectrum.f90 nopscalar.f90 noradiation.f90 noselfgravity.f90 noshear.f90 shock.f90 nosignal_handling.f90 nosolid_cells.f90 special/solar_corona.f90 noascalar.f90 nostreamlines.f90  notestfield.f90 notestflow.f90 notestscalar.f90 viscosity.f90 cparam.local -o cparam.inc.tmp
${PENCIL_HOME}/utils/pc_identify_revision --reset
make -f Makefile.src  start.o run.o combine_videofiles.o read_videofiles.o read_all_videofiles.o read_vectorfiles.o pre_and_post_processing/pc_collect.o pre_and_post_processing/pc_reduce.o pre_and_post_processing/pc_distribute.o pre_and_post_processing/pc_distribute_z.o pre_and_post_processing/pc_extract.o pre_and_post_processing/pc_configtest.o pre_and_post_processing/pc_tecplot.o pre_and_post_processing/pc_tecplot_solid.o start.x run.x combine_videofiles.x read_videofiles.x read_all_videofiles.x read_vectorfiles.x pre_and_post_processing/pc_collect.x pre_and_post_processing/pc_reduce.x pre_and_post_processing/pc_distribute.x pre_and_post_processing/pc_distribute_z.x pre_and_post_processing/pc_extract.x pre_and_post_processing/pc_configtest.x pre_and_post_processing/pc_tecplot.x pre_and_post_processing/pc_tecplot_solid.x
make[2]: Entering directory '/home/sbinger1/pencil-code/samples/corona/src'
mpif90 -O -fdefault-real-8 -fdefault-double-8   -std=f95 -o cparam.o -c cparam.f90
sed -e 's/REAL/DOUBLE_PRECISION/g' -e 's/MPI_COMPLEX/MPI_DOUBLE_COMPLEX/g' mpicomm.f90 > mpicomm_double.f90
mpicc -DFUNDERSC=1 -DDOUBLE_PRECISION   -o syscalls_ansi.o -c syscalls_ansi.c
scripts/mkdummyinc -d file_io_common.f90 -s file_io_f95.f90 -o file_io_common.inc
mpif90 -O -fdefault-real-8 -fdefault-double-8    -o fftpack.o -c fftpack.f90
scripts/mkdummyinc -d nospecial.f90 -s special/solar_corona.f90 -o special_dummies.inc
mpicc -DFUNDERSC=1 -DDOUBLE_PRECISION   -o nogsl.o -c nogsl.c
cparam_pencils.inc:523:0:

    , 'uxj             ', 'chibp           ', 'beta            ', 'beta1           '  &
 1
Warning: Limit of 39 continuations exceeded in statement at (1)
mpif90 -O -fdefault-real-8 -fdefault-double-8   -std=f95 -o cdata.o -c cdata.f90
mpif90 -O -fdefault-real-8 -fdefault-double-8   -std=f95 -o nosolid_cells_ogrid_cdata.o -c nosolid_cells_ogrid_cdata.f90
fftpack.f90:154:33:

         call passb4 ( 2*ido, l1, c, ch, wa(iw), wa(ix2), wa(ix3) )
                                 1
Warning: Type mismatch in argument ‘cc’ at (1); passed COMPLEX(8) to REAL(8)
fftpack.f90:156:33:

         call passb4 ( 2*ido, l1, ch, c, wa(iw), wa(ix2), wa(ix3) )
                                 1
Warning: Type mismatch in argument ‘cc’ at (1); passed COMPLEX(8) to REAL(8)
fftpack.f90:164:33:

         call passb2 ( 2*ido, l1, c, ch, wa(iw) )
                                 1
Warning: Type mismatch in argument ‘cc’ at (1); passed COMPLEX(8) to REAL(8)
fftpack.f90:166:33:

         call passb2 ( 2*ido, l1, ch, c, wa(iw) )
                                 1
Warning: Type mismatch in argument ‘cc’ at (1); passed COMPLEX(8) to REAL(8)
fftpack.f90:176:33:

         call passb3 ( 2*ido, l1, c, ch, wa(iw), wa(ix2) )
                                 1
Warning: Type mismatch in argument ‘cc’ at (1); passed COMPLEX(8) to REAL(8)
fftpack.f90:178:33:

         call passb3 ( 2*ido, l1, ch, c, wa(iw), wa(ix2) )
                                 1
Warning: Type mismatch in argument ‘cc’ at (1); passed COMPLEX(8) to REAL(8)
fftpack.f90:190:33:

         call passb5 ( 2*ido, l1, c, ch, wa(iw), wa(ix2), wa(ix3), wa(ix4) )
                                 1
Warning: Type mismatch in argument ‘cc’ at (1); passed COMPLEX(8) to REAL(8)
fftpack.f90:192:33:

         call passb5 ( 2*ido, l1, ch, c, wa(iw), wa(ix2), wa(ix3), wa(ix4) )
                                 1
Warning: Type mismatch in argument ‘cc’ at (1); passed COMPLEX(8) to REAL(8)
fftpack.f90:200:47:

         call passb ( nac, 2*ido, ip, l1, idl1, c, c, c, ch, ch, wa(iw) )
                                               1
Warning: Type mismatch in argument ‘cc’ at (1); passed COMPLEX(8) to REAL(8)
fftpack.f90:202:47:

         call passb ( nac, 2*ido, ip, l1, idl1, ch, ch, ch, c, c, wa(iw) )
                                               1
Warning: Type mismatch in argument ‘cc’ at (1); passed COMPLEX(8) to REAL(8)
fftpack.f90:76:22:

   call cfftb1 ( n, c, wsave(1), wsave(2*n+1), wsave(4*n+1) )
                      1
Warning: Type mismatch in argument ‘ch’ at (1); passed REAL(8) to COMPLEX(8)
fftpack.f90:447:33:

         call passf4 ( 2*ido, l1, c, ch, wa(iw), wa(ix2), wa(ix3) )
                                 1
Warning: Type mismatch in argument ‘cc’ at (1); passed COMPLEX(8) to REAL(8)
fftpack.f90:449:33:

         call passf4 ( 2*ido, l1, ch, c, wa(iw), wa(ix2), wa(ix3) )
                                 1
Warning: Type mismatch in argument ‘cc’ at (1); passed COMPLEX(8) to REAL(8)
fftpack.f90:457:33:

         call passf2 ( 2*ido, l1, c, ch, wa(iw) )
                                 1
Warning: Type mismatch in argument ‘cc’ at (1); passed COMPLEX(8) to REAL(8)
fftpack.f90:459:33:

         call passf2 ( 2*ido, l1, ch, c, wa(iw) )
                                 1
Warning: Type mismatch in argument ‘cc’ at (1); passed COMPLEX(8) to REAL(8)
fftpack.f90:469:33:

         call passf3 ( 2*ido, l1, c, ch, wa(iw), wa(ix2) )
                                 1
Warning: Type mismatch in argument ‘cc’ at (1); passed COMPLEX(8) to REAL(8)
fftpack.f90:471:33:

         call passf3 ( 2*ido, l1, ch, c, wa(iw), wa(ix2) )
                                 1
Warning: Type mismatch in argument ‘cc’ at (1); passed COMPLEX(8) to REAL(8)
fftpack.f90:483:33:

         call passf5 ( 2*ido, l1, c, ch, wa(iw), wa(ix2), wa(ix3), wa(ix4) )
                                 1
Warning: Type mismatch in argument ‘cc’ at (1); passed COMPLEX(8) to REAL(8)
fftpack.f90:485:33:

         call passf5 ( 2*ido, l1, ch, c, wa(iw), wa(ix2), wa(ix3), wa(ix4) )
                                 1
Warning: Type mismatch in argument ‘cc’ at (1); passed COMPLEX(8) to REAL(8)
fftpack.f90:493:47:

         call passf ( nac, 2*ido, ip, l1, idl1, c, c, c, ch, ch, wa(iw) )
                                               1
Warning: Type mismatch in argument ‘cc’ at (1); passed COMPLEX(8) to REAL(8)
fftpack.f90:495:47:

         call passf ( nac, 2*ido, ip, l1, idl1, ch, ch, ch, c, c, wa(iw) )
                                               1
Warning: Type mismatch in argument ‘cc’ at (1); passed COMPLEX(8) to REAL(8)
fftpack.f90:370:22:

   call cfftf1 ( n, c, wsave(1), wsave(2*n+1), wsave(4*n+1) )
                      1
Warning: Type mismatch in argument ‘ch’ at (1); passed REAL(8) to COMPLEX(8)
fftpack.f90:645:33:

   call cffti1 ( n, wsave(2*n+1), wsave(4*n+1) )
                                 1
Warning: Type mismatch in argument ‘ifac’ at (1); passed REAL(8) to INTEGER(4)
fftpack.f90:6575:44:

   call rfftb1 ( n, r, wsave(1), wsave(n+1), wsave(2*n+1) )
                                            1
Warning: Type mismatch in argument ‘ifac’ at (1); passed REAL(8) to INTEGER(4)
fftpack.f90:6802:44:

   call rfftf1 ( n, r, wsave(1), wsave(n+1), wsave(2*n+1) )
                                            1
Warning: Type mismatch in argument ‘ifac’ at (1); passed REAL(8) to INTEGER(4)
fftpack.f90:6999:31:

   call rffti1 ( n, wsave(n+1), wsave(2*n+1) )
                               1
Warning: Type mismatch in argument ‘ifac’ at (1); passed REAL(8) to INTEGER(4)
fftpack.f90:2248:44:

   call dfftf1 ( n, r, wsave(1), wsave(n+1), wsave(2*n+1) )
                                            1
Warning: Type mismatch in argument ‘ifac’ at (1); passed REAL(8) to INTEGER(4)
fftpack.f90:2445:31:

   call dffti1 ( n, wsave(n+1), wsave(2*n+1) )
                               1
Warning: Type mismatch in argument ‘ifac’ at (1); passed REAL(8) to INTEGER(4)
fftpack.f90:2680:56:

   call dsint1 ( n, x, wsave(1), wsave(iw1), wsave(iw2), wsave(iw3) )
                                                        1
Warning: Type mismatch in argument ‘ifac’ at (1); passed REAL(8) to INTEGER(4)
fftpack.f90:3357:34:

   call ezffti1 ( n, wsave(2*n+1), wsave(3*n+1) )
                                  1
Warning: Type mismatch in argument ‘ifac’ at (1); passed REAL(8) to INTEGER(4)
fftpack.f90:8147:56:

   call rsint1 ( n, x, wsave(1), wsave(iw1), wsave(iw2), wsave(iw3) )
                                                        1
Warning: Type mismatch in argument ‘ifac’ at (1); passed REAL(8) to INTEGER(4)
mpif90 -O -fdefault-real-8 -fdefault-double-8   -std=f95 -o general.o -c general.f90
mpif90 -O -fdefault-real-8 -fdefault-double-8   -std=f95 -o particles_cdata.o -c particles_cdata.f90
mpif90 -O -fdefault-real-8 -fdefault-double-8   -std=f95 -o syscalls.o -c syscalls.f90
mpif90 -O -fdefault-real-8 -fdefault-double-8   -std=f95 -o noyinyang.o -c noyinyang.f90
mpif90 -O -fdefault-real-8 -fdefault-double-8   -std=f95 -o slices_methods.o -c slices_methods.f90
mpif90 -O -fdefault-real-8 -fdefault-double-8   -std=f95 -o noweno_transport.o -c noweno_transport.f90
mpif90 -O -fdefault-real-8 -fdefault-double-8    -o mpicomm_double.o -c mpicomm_double.f90
mpif90 -O -fdefault-real-8 -fdefault-double-8   -std=f95 -o nompicomm.o -c nompicomm.f90
mpif90 -O -fdefault-real-8 -fdefault-double-8   -std=f95 -o messages.o -c messages.f90
mpif90 -O -fdefault-real-8 -fdefault-double-8   -std=f95 -o ghost_check.o -c ghost_check.f90
mpif90 -O -fdefault-real-8 -fdefault-double-8   -std=f95 -o nogpu.o -c nogpu.f90
mpif90 -O -fdefault-real-8 -fdefault-double-8   -std=f95 -o nosolid_cells_mpicomm.o -c nosolid_cells_mpicomm.f90
mpif90 -O -fdefault-real-8 -fdefault-double-8   -std=f95 -o deriv.o -c deriv.f90
mpif90 -O -fdefault-real-8 -fdefault-double-8   -std=f95 -I/usr/include -o hdf5_io_parallel.o -c hdf5_io_parallel.f90
mpif90 -O -fdefault-real-8 -fdefault-double-8   -o file_io_f95.o -c file_io_f95.f90
mpif90 -O -fdefault-real-8 -fdefault-double-8   -std=f95 -o noyinyang_mpi.o -c noyinyang_mpi.f90
mpif90 -O -fdefault-real-8 -fdefault-double-8   -std=f95 -o shared_variables.o -c shared_variables.f90
mpif90 -O -fdefault-real-8 -fdefault-double-8   -std=f95 -o debug_io_dist.o -c debug_io_dist.f90
mpif90 -O -fdefault-real-8 -fdefault-double-8   -std=f95 -o noimplicit_diffusion.o -c noimplicit_diffusion.f90
deriv.f90:2068:0:

              ( 3572100.0 * f( l1:l2 , m + 2 , n + 1 , k ))+&
 1
Warning: Limit of 39 continuations exceeded in statement at (1)
deriv.f90:2627:0:

                ( 1170.0 * f( l1+1:l2+1 , m + 3 , n - 1 , ik ))+&
 1
Warning: Limit of 39 continuations exceeded in statement at (1)
deriv.f90:2888:0:

                ( 1170.0 * f( l1+1:l2+1 , m - 1 , n + 3 , ik ))+&
 1
Warning: Limit of 39 continuations exceeded in statement at (1)
hdf5_io_parallel.f90:11:6:

   use HDF5
      1
Fatal Error: Can't open module file ‘hdf5.mod’ for reading at (1): No such file or directory
compilation terminated.
Makefile.src:2556: recipe for target 'hdf5_io_parallel.o' failed
make[2]: *** [hdf5_io_parallel.o] Error 1
make[2]: *** Waiting for unfinished jobs....
deriv.f90:3149:0:

                ( 1170.0 * f( l1+3:l2+3 , m + 1 , n - 1 , ik ))+&
 1
Warning: Limit of 39 continuations exceeded in statement at (1)
deriv.f90:3410:0:

                ( 1170.0 * f( l1-1:l2-1 , m + 1 , n + 3 , ik ))+&
 1
Warning: Limit of 39 continuations exceeded in statement at (1)
deriv.f90:3671:0:

                ( 1170.0 * f( l1+3:l2+3 , m - 1 , n + 1 , ik ))+&
 1
Warning: Limit of 39 continuations exceeded in statement at (1)
deriv.f90:3932:0:

                ( 1170.0 * f( l1-1:l2-1 , m + 3 , n + 1 , ik ))+&
 1
Warning: Limit of 39 continuations exceeded in statement at (1)
deriv.f90:4231:0:

                ( 1755.0 * f( l1+1:l2+1 , m + 3 , n - 1 , ik ))+&
 1
Warning: Limit of 39 continuations exceeded in statement at (1)
deriv.f90:4492:0:

                ( 1755.0 * f( l1+3:l2+3 , m + 1 , n - 1 , ik ))+&
 1
Warning: Limit of 39 continuations exceeded in statement at (1)
deriv.f90:4753:0:

                ( 1755.0 * f( l1+3:l2+3 , m - 1 , n + 1 , ik ))+&
 1
Warning: Limit of 39 continuations exceeded in statement at (1)
make[2]: Leaving directory '/home/sbinger1/pencil-code/samples/corona/src'
Makefile.src:2717: recipe for target 'code' failed
make[1]: *** [code] Error 2
make[1]: Leaving directory '/home/sbinger1/pencil-code/samples/corona/src'
Makefile:23: recipe for target 'default_to_be' failed
make: *** [default_to_be] Error 2
'make -j FFLAGS_DOUBLE=-fdefault-real-8 -fdefault-double-8 CFLAGS_DOUBLE=-DDOUBLE_PRECISION LD_MPI= CFLAGS_FFTW3= FFLAGS_FFTW3= LD_FFTW3= CFLAGS_FFTW2= FFLAGS_FFTW2= LD_FFTW2= FC=mpif90 F77=mpif77 FFLAGS=-O LDFLAGS_HELPER=-dynamic -ldl FSTD_95=-std=f95 FSTD_2003=-std=f2003 CC=mpicc CFLAGS=-DFUNDERSC=1 default_to_be' failed: <> ['\nice -n 15 pc_build --config-files=/home/sbinger1/bin/GNU_Linux.conf ' reported: ]

samples/0d-tests/heating_ionize: (10/53)
    Compiling..            [double]           ok        00:47
    Starting..                                ok        00:00
    Running..              [KEEP_RELOADING]   ok        00:08
    Validating results..                      ok      
    Time used:                                        00:56 = 00:47 + 00:08

samples/0d-tests/heating_noionize: (11/53)
    Compiling..                               ok        00:46
    Starting..                                ok        00:00
    Running..              [KEEP_RELOADING]   ok        00:00
    Validating results..                      ok      
    Time used:                                        00:46 = 00:46 + 00:00

samples/1d-tests/H2_flamespeed: (12/53)
    Compiling..                               ok        00:49
    Starting..                                ok        00:00
    Running..              [KEEP_RELOADING]   ok        00:05
    Validating results..                      ok      
    Time used:                                        00:55 = 00:49 + 00:05

samples/chiral-diffusion: (13/53)
    Compiling..                               ok        00:39
    Starting..                                ok        00:00
    Running..              [KEEP_RELOADING]   ok        00:00
    Validating results..                      ok      
    Time used:                                        00:39 = 00:39 + 00:00

samples/cosmicray: (14/53)
    Compiling..                               ok        00:52
    Starting..                                ok        00:00
    Running..              [KEEP_RELOADING]   ok        00:00
    Validating results..                      ok      
    Time used:                                        00:53 = 00:52 + 00:00

samples/1d-tests/sod_10: (15/53)
    Compiling..                               ok        00:53
    Starting..                                ok        00:00
    Running..              [KEEP_RELOADING]   ok        00:01
    Validating results..                      ok      
    Time used:                                        00:54 = 00:53 + 00:01

samples/1d-tests/ambipolar_diffusion: (16/53)
    Compiling..                               ok        01:00
    Starting..                                ok        00:00
    Running..              [KEEP_RELOADING]   ok        00:03
    Validating results..                      ok      
    Time used:                                        01:04 = 01:00 + 00:03

samples/GravitationalWaves: (17/53)
    Compiling..                               ok        01:30
    Starting..                                ok        00:00
    Running..              [KEEP_RELOADING]   ok        00:01
    Validating results..                      ok      
    Time used:                                        01:32 = 01:30 + 00:01

samples/polymer/forced_3dturbulence: (18/53)
    Compiling..                               ok        01:07
    Starting..                                ok        00:00
    Running..              [KEEP_RELOADING]   ok        00:10
    Validating results..                      ok      
    Time used:                                        01:18 = 01:07 + 00:10

samples/testfield_z: (19/53)
    Compiling..                               ok        01:10
    Starting..                                ok        00:00
    Running..              [KEEP_RELOADING]   ok        00:16
    Validating results..                      ok      
    Time used:                                        01:26 = 01:10 + 00:16

samples/random_uu_particles: (20/53)
    Compiling..                               ok        01:11
    Starting..                                ok        00:00
    Running..              [KEEP_RELOADING]   ok        00:56
    Validating results..                      ok      
    Time used:                                        02:07 = 01:11 + 00:56

samples/1d-tests/solar-atmosphere-temperature: (21/53)
    Compiling..            [double]           ok        00:49
    Starting..                                ok        00:00
    Running..              [KEEP_RELOADING]   ok        00:13
    Validating results..                      ok      
    Time used:                                        01:03 = 00:49 + 00:14

samples/kin-dynamo: (22/53)
    Compiling..                               ok        00:58
    Starting..                                ok        00:00
    Running..              [KEEP_RELOADING]   ok        00:07
    Validating results..                      ok      
    Time used:                                        01:05 = 00:58 + 00:07

samples/meissner: (23/53)
    Compiling..            [double]           ok        01:14
    Starting..                                ok        00:00
    Running..              [KEEP_RELOADING]   ok        00:15
    Validating results..                      ok      
    Time used:                                        01:29 = 01:14 + 00:15

samples/conv-slab-noequi: (24/53)
    Compiling..                               ok        01:03
    Starting..                                ok        00:00
    Running..              [KEEP_RELOADING]   ok        00:32
    Validating results..                      ok      
    Time used:                                        01:35 = 01:03 + 00:32

samples/2d-tests/selfgravitating-shearwave: (25/53)
    Compiling..                               ok        01:00
    Starting..                                ok        00:00
    Running..              [KEEP_RELOADING]   ok        00:02
    Validating results..                      ok      
    Time used:                                        01:02 = 01:00 + 00:02

samples/2d-tests/streaming_instability: (26/53)
    Compiling..                               ok        01:09
    Starting..                                ok        00:00
    Running..              [KEEP_RELOADING]   ok        00:14
    Validating results..                      ok      
    Time used:                                        01:23 = 01:09 + 00:14

samples/2d-tests/globaldisc: (27/53)
    Compiling..                               ok        01:03
    Starting..                                ok        00:00
    Running..              [KEEP_RELOADING]   ok        00:28
    Validating results..                      ok      
    Time used:                                        01:32 = 01:03 + 00:28

samples/2d-tests/cylindrical_gdisk: (28/53)
    Compiling..                               ok        00:55
    Starting..                                ok        00:00
    Running..              [KEEP_RELOADING]   ok        00:00
    Validating results..                      ok      
    Time used:                                        00:55 = 00:55 + 00:00

samples/2d-tests/planet-disk-fargo: (29/53)
    Compiling..                               ok        01:00
    Starting..                                ok        00:00
    Running..              [KEEP_RELOADING]   ok        00:00
    Validating results..                      ok      
    Time used:                                        01:01 = 01:00 + 00:00

samples/spherical-globaldisk: (30/53)
    Compiling..                               ok        01:09
    Starting..                                ok        00:00
    Running..              [KEEP_RELOADING]   ok        00:00
    Validating results..                      ok      
    Time used:                                        01:10 = 01:09 + 00:00

samples/spherical-globaldisk-mhd: (31/53)
    Compiling..                               ok        01:20
    Starting..                                ok        00:00
    Running..              [KEEP_RELOADING]   ok        00:05
    Validating results..                      ok      
    Time used:                                        01:26 = 01:20 + 00:05

samples/spherical-gdisk-planet-thermo: (32/53)
    Compiling..                               ok        01:19
    Starting..                                ok        00:00
    Running..              [KEEP_RELOADING]   ok        00:24
    Validating results..                      ok      
    Time used:                                        01:44 = 01:19 + 00:25

samples/0d-tests/solar_system: (33/53)
    Compiling..                               ok        00:52
    Starting..                                ok        00:00
    Running..              [KEEP_RELOADING]   ok        00:00
    Validating results..                      ok      
    Time used:                                        00:53 = 00:52 + 00:00

samples/mdwarf: (34/53)
    Compiling..                               ok        01:14
    Starting..                                ok        00:00
    Running..              [KEEP_RELOADING]   ok        00:13
    Validating results..                      ok      
    Time used:                                        01:28 = 01:14 + 00:14

samples/sedimentation: (35/53)
    Compiling..                               ok        01:17
    Starting..                                ok        00:00
    Running..              [KEEP_RELOADING]   ok        00:02
    Validating results..                      ok      
    Time used:                                        01:20 = 01:17 + 00:02

samples/MRI-turbulence_hyper: (36/53)
    Compiling..            [double]           ok        01:19
    Starting..                                ok        00:00
    Running..              [KEEP_RELOADING]   ok        00:07
    Validating results..                      ok      
    Time used:                                        01:27 = 01:19 + 00:08

samples/dust_turb_globaldisk: (37/53)
    Compiling..                               ok        01:37
    Starting..                                ok        00:00
    Running..              [KEEP_RELOADING]   ok        00:36
    Validating results..                      ok      
    Time used:                                        02:14 = 01:37 + 00:36

samples/geodynamo: (38/53)
    Compiling..                               ok        01:19
    Starting..                                ok        00:00
    Running..              [KEEP_RELOADING]   ok        00:06
    Validating results..                      ok      
    Time used:                                        01:25 = 01:19 + 00:06

samples/2d-tests/cylinder_deposition: (39/53)
    Compiling..                               ok        01:01
    Starting..                                ok        00:00
    Running..              [KEEP_RELOADING]   ok        00:08
    Validating results..                      ok      
    Time used:                                        01:11 = 01:01 + 00:09

samples/2d-tests/selfgravdisk-deadzone-dust: (40/53)
    Compiling..                               ok        01:07
    Starting..                                ok        00:02
    Running..              [KEEP_RELOADING]   ok        03:28
    Validating results..                      ok      
    Time used:                                        04:38 = 01:07 + 03:31

samples/2d-tests/spherical_viscous_ring: (41/53)
    Compiling..                               ok        01:02
    Starting..                                ok        00:00
    Running..              [KEEP_RELOADING]   ok        00:02
    Validating results..                      ok      
    Time used:                                        01:04 = 01:02 + 00:02

samples/2d-tests/field-loop-fargo: (42/53)
    Compiling..                               ok        01:10
    Starting..                                ok        00:00
    Running..              [KEEP_RELOADING]   ok        00:01
    Validating results..                      ok      
    Time used:                                        01:12 = 01:10 + 00:01

samples/baroclinic: (43/53)
    Compiling..                               ok        01:19
    Starting..                                ok        00:00
    Running..              [KEEP_RELOADING]   ok        00:11
    Validating results..                      ok      
    Time used:                                        01:30 = 01:19 + 00:11

samples/1d-tests/sedimentation-noneq-blocks: (44/53)
    Compiling..                               ok        01:01
    Starting..                                ok        00:00
    Running..              [KEEP_RELOADING]   ok        00:00
    Validating results..                      ok      
    Time used:                                        01:01 = 01:01 + 00:00

samples/1d-tests/alphadisk: (45/53)
    Compiling..                               ok        00:49
    Starting..                                ok        00:01
    Running..              [KEEP_RELOADING]   ok        00:01
    Validating results..                      ok      
    Time used:                                        00:52 = 00:49 + 00:03

samples/implicit_resistivity: (46/53)
    Compiling..                               ok        01:03
    Starting..                                ok        00:00
    Running..              [KEEP_RELOADING]   ok        00:12
    Validating results..                      ok      
    Time used:                                        01:16 = 01:03 + 00:12

samples/debris-photoelectric-fluid: (47/53)
    Compiling..                               ok        01:12
    Starting..                                ok        00:00
    Running..              [KEEP_RELOADING]   ok        00:05
    Validating results..                      ok      
    Time used:                                        01:17 = 01:12 + 00:05

samples/2d-tests/debris-photoeletric-streaming: (48/53)
    Compiling..                               ok        01:15
    Starting..                                ok        00:00
    Running..              [KEEP_RELOADING]   ok        00:00
    Validating results..                      ok      
    Time used:                                        01:16 = 01:15 + 00:01

samples/2d-tests/Kelvin-Helmholtz: (49/53)
    Compiling..                               ok        00:59
    Starting..                                ok        00:00
    Running..              [KEEP_RELOADING]   ok        00:00
    Validating results..                      ok      
    Time used:                                        01:00 = 00:59 + 00:00

samples/2d-tests/selfgravdisk-planet-dust: (50/53)
    Compiling..                               ok        01:08
    Starting..                                ok        00:01
    Running..              [KEEP_RELOADING]   ok        03:24
    Validating results..                      ok      
    Time used:                                        04:35 = 01:08 + 03:26

samples/cylindrical-globaldisk-dzone: (51/53)
    Compiling..                               ok        01:20
    Starting..                                ok        00:00
    Running..              [KEEP_RELOADING]   ok        00:01
    Validating results..                      ok      
    Time used:                                        01:22 = 01:20 + 00:01

samples/2d-tests/selfgravdisk-logspirals: (52/53)
    Compiling..                               ok        00:55
    Starting..                                ok        00:00
    Running..              [KEEP_RELOADING]   ok        00:02
    Validating results..                      ok      
    Time used:                                        00:57 = 00:55 + 00:02

samples/2d-tests/turbulent_potential: (53/53)
    Compiling..                               ok        01:09
    Starting..                                ok        00:00
    Running..              [KEEP_RELOADING]   ok        00:03
    Validating results..                      ok      
    Time used:                                        01:13 = 01:09 + 00:04

----------------------------------------------------------------------
### auto-test failed ###
Failed 1 test(s) out of 53:
CPU time (including compilation): 02:07:45u 06:21s
Total wall-clock time:            01:12:54 = 56:36 + 15:51

----------------------------------------------------------------------
The following configuration has been used:
$config = {
            'makefile' => {
                            'FFLAGS_FFTW3' => '',
                            'CFLAGS' => '-DFUNDERSC=1',
                            'MAKE_VAR1' => '-j',
                            'FSTD_95' => '-std=f95',
                            'CC' => 'mpicc',
                            'F77' => 'mpif77',
                            'CFLAGS_DOUBLE' => '-DDOUBLE_PRECISION',
                            'CFLAGS_FFTW3' => '',
                            'LDFLAGS_HELPER' => '-dynamic -ldl',
                            'LD_MPI' => '',
                            'FC' => 'mpif90',
                            'CFLAGS_FFTW2' => '',
                            'FFLAGS_FFTW2' => '',
                            'LD_FFTW2' => '',
                            'FSTD_2003' => '-std=f2003',
                            'FFLAGS' => '-O',
                            'FFLAGS_DOUBLE' => '-fdefault-real-8 -fdefault-double-8',
                            'LD_FFTW3' => ''
                          },
            'runtime' => {
                           'mpiexec' => 'mpiexec',
                           'mpiexec_opts' => '',
                           'mpiexec_opts2' => ''
                         },
            'environment' => {
                               'MODULE_SUFFIX' => '',
                               'MODULE_PREFIX' => '__',
                               'MODULE_INFIX' => '_MOD_'
                             }
          };
Perl version v5.22.1
Mon Dec 17 01:14:00 2018